Compiling Error

classic Classic list List threaded Threaded
1 message Options
Reply | Threaded
Open this post in threaded view
|

Compiling Error

alkos333
I'm getting the following when trying to compile:


dummy_driver.c: In function `FakeVideoSync':
dummy_driver.c:48: error: initializer element is not constant
make[3]: *** [dummy_driver.lo] Error 1
make[3]: Leaving directory `/tmp/SBo/jack-audio-connection-kit-0.103.0/drivers/dummy'
make[2]: *** [all-recursive] Error 1
make[2]: Leaving directory `/tmp/SBo/jack-audio-connection-kit-0.103.0/drivers'
make[1]: *** [all-recursive] Error 1
make[1]: Leaving directory `/tmp/SBo/jack-audio-connection-kit-0.103.0'
make: *** [all] Error 2


I have no idea what the problem is and looks like it within the tarball.



Best Regards,
Alex

-------------------------------------------------------------------------
This SF.net email is sponsored by DB2 Express
Download DB2 Express C - the FREE version of DB2 express and take
control of your XML. No limits. Just data. Click to get it now.
http://sourceforge.net/powerbar/db2/
_______________________________________________
Jackit-devel mailing list
[hidden email]
https://lists.sourceforge.net/lists/listinfo/jackit-devel